{"text_format":"1","workbook":"xlsx","n_sheets":9,"sheets":["INFO","NUTRIEN SAPI PERAH","NUTRIEN SAPI POTONG","BAHAN PAKAN","SAPI PERAH","SAPI POTONG","TRIAL & ERROR","CONTACT","BACKUP"],"not_rendered":{"charts":0,"images":15,"macros":1,"external_links":1,"defined_names":1597,"comments":0,"pivot_tables":0},"unopened":[],"bounds":{"document_bytes":16777216,"sheet_cells":100000,"rows_first":2000,"rows_last":500,"rows_between":2000,"halvings":0,"cell_chars":16384,"cell_head_chars":4096},"cells_cut":0,"cells_raw":0,"read":"whole","date_system":"1900"}

{"sheet":"INFO","index":0,"n_rows":31,"n_cols":3,"rows_kept":31,"cut":false,"hidden":false,"merged":[]}
[]
[null,null,"FORSUM for Ruminant ver 4.0++"]
[null,null," (c) 2019 Department of Nutrition and Feed Technology - IPB University"]
[]
[]
[]
[]
[]
{"$rows_left_out":24}
{"sheet":"NUTRIEN SAPI PERAH","index":1,"n_rows":44,"n_cols":9,"rows_kept":44,"cut":false,"hidden":false,"merged":[[5,5,5,6],[5,7,5,8],[19,1,20,1],[19,2,20,2],[19,3,19,4],[19,5,19,6],[19,7,19,8],[33,1,34,1],[33,2,34,2],[33,3,33,4],[5,1,6,1],[5,2,6,2],[5,3,5,4]]}
[]
[null,"        FORSUM for Ruminant ver 4.0++"]
[null,"                  (c) 2019 Department of Nutrition and Feed Technology - IPB University"]
[]
[null,"Tabel A1. Kebutuhan Nutrien pada Sapi Perah (SNI 3148-1:2017)"]
[null,"Nutrien","Unit","Calf Starter 1",null,"Calf Starter 2",null,"Dara"]
[null,null,null,"Min","Max","Min","Max","Min","Max"]
[null,"Bahan Kering","%",86,"-",86,"-",86,"-"]
{"$rows_left_out":37}
{"sheet":"NUTRIEN SAPI POTONG","index":2,"n_rows":53,"n_cols":9,"rows_kept":53,"cut":false,"hidden":false,"merged":[[5,1,6,1],[5,2,6,2],[5,3,5,4],[5,5,5,6],[5,7,5,8],[20,7,21,7],[20,8,21,8],[20,1,21,1],[20,2,21,2],[20,3,21,3],[20,4,21,4],[20,5,21,5],[20,6,21,6]]}
[]
[null,"         FORSUM for Ruminant ver 4.0++"]
[null,"                (c) 2019 Department of Nutrition and Feed Technology - IPB University"]
[]
[null,"Tabel B1. Kebutuhan Nutrien pada Sapi Potong (SNI 3148-2:2017)"]
[null,"Nutrien","Unit","Konst Penggemukan",null,"Konsentrat Induk",null,"Konsentrat Pejantan"]
[null,null,null,"Min","Max","Min","Max","Min","Max"]
[null,"Bahan Kering","%",86,"-",86,"-",86,"-"]
{"$rows_left_out":46}
{"sheet":"BAHAN PAKAN","index":3,"n_rows":106,"n_cols":25,"rows_kept":106,"cut":false,"hidden":false,"merged":[]}
[]
[null,null,null,"FORSUM for Ruminant ver 4.0++"]
[null,null,null," (c) 2019 Department of Nutrition and Feed Technology - IPB University"]
[]
[null,"Tabel C1. Komposisi Nutrien Bahan Pakan"]
[null,"No",null,"Bahan Pakan","Min","Max","Harga AsFeed","Harga BK","Kadar Air","Bahan Kering","Abu","PK","LK","SK","BETN","NDF","ADF","GE","DE","TDN","Ca","P","K","Na","DM"]
[null,null,null,"== HIJAUAN =="]
[null,1,null,"Rumput gajah",null,null,230,{"$f":"G8*100/Y8","v":1284.916201117318},{"$f":"100-J8","v":82.1},17.900000000000006,13.8,9.6999999999999993,2,36.1,38.4,71.5,42.5,17.399999999999999,10.199999999999999,58,0.36,0.28999999999999998,2.9,0.03,{"$f":"100-I8","v":17.900000000000006}]
{"$rows_left_out":99}
{"sheet":"SAPI PERAH","index":4,"n_rows":26,"n_cols":55,"rows_kept":26,"cut":false,"hidden":false,"merged":[[4,15,4,23],[23,15,24,15],[24,21,24,23],[25,1,25,13]]}
[]
[null,null,null,"FORSUM for Ruminant ver 4.0++"]
[null,null,null," (c) 2019 Department of Nutrition and Feed Technology - IPB University",null,null,null,null,null,null,null,null,null,null,null,"Nama Ransum",":","Konsentrat Sapi Perah Laktasi"]
[null,null,null,null,null,null,null,null,null,null,null,null,null,null,null,"Formulator",":","Idat G. Permana"]
[null,"Tabel 1. Komposisi Ransum (Least Cost Ration)",null,null,null,null,null,null,null,null,null,null,null,null,null,"Tabel 2. Kandungan Nutrien Ransum (% DM)",null,null,null,null,null,null,null,null,null,null,"Tabel 3. Perhitungan Ransum (Jangan Dihapus)"]
[" ","No",null,"Bahan Pakan",null,"Harga",null,"Min",null,"%BK",null,"%AsFeed",null,"Max",null,"Nutrien",null,"Unit",null,"Min",null,"Nutrien",null,"Max",null,null,"No","Ingredient","Harga BK","KA","Abu","PK","LK","SK","BETN","NDF","ADF","GE","DE","TDN","Ca","P","K","Na","BK","Bahan Pakan","Min","Komposisi Ransum","Max","Nutrien","Min","Nutrient","Max","%AsFeed","%AsFeed"]
[]
[null,1,null,"Jagung",null,{"$f":"_xlfn.IFNA(VLOOKUP($D8,'BAHAN PAKAN'!$D$7:$Y$106,4,FALSE),0)","v":4500},null,5,null,5.0000000000000053,null,{"$f":"BB8/($BB$24/100)","v":3.7391556250110058},null,null,null,"Kadar Air",null,"%",null,null,null,{"$f":"AZ8","v":22.357642624508706},null,null,null,null,1,{"$f":"_xlfn.IFNA(VLOOKUP(D8,'BAHAN PAKAN'!$D$7:$Y$106,1,FALSE),0)","v":"Jagung"},{"$f":"IF(F8>0,F8*100/AS8,99999999)","v":5214.3684820393973},{"$f":"_xlfn.IFNA(VLOOKUP(D8,'BAHAN PAKAN'!$D$7:$Y$106,6,FALSE),0)","v":13.700000000000003},{"$f":"_xlfn.IFNA(VLOOKUP(D8,'BAHAN PAKAN'!$D$7:$Y$106,8,FALSE),0)","v":1.4},{"$f":"_xlfn.IFNA(VLOOKUP(D8,'BAHAN PAKAN'!$D$7:$Y$106,9,FALSE),0)","v":9.4},{"$f":"_xlfn.IFNA(VLOOKUP(D8,'BAHAN PAKAN'!$D$7:$Y$106,10,FALSE),0)","v":4.3},{"$f":"_xlfn.IFNA(VLOOKUP(D8,'BAHAN PAKAN'!$D$7:$Y$106,11,FALSE),0)","v":2.5},{"$f":"_xlfn.IFNA(VLOOKUP(D8,'BAHAN PAKAN'!$D$7:$Y$106,12,FALSE),0)","v":82.4},{"$f":"_xlfn.IFNA(VLOOKUP(D8,'BAHAN PAKAN'!$D$7:$Y$106,13,FALSE),0)","v":12.2},{"$f":"_xlfn.IFNA(VLOOKUP(D8,'BAHAN PAKAN'!$D$7:$Y$106,14,FALSE),0)","v":3},{"$f":"_xlfn.IFNA(VLOOKUP(D8,'BAHAN PAKAN'!$D$7:$Y$106,15,FALSE),0)","v":18.7},{"$f":"_xlfn.IFNA(VLOOKUP(D8,'BAHAN PAKAN'!$D$7:$Y$106,16,FALSE),0)","v":12},{"$f":"_xlfn.IFNA(VLOOKUP(D8,'BAHAN PAKAN'!$D$7:$Y$106,17,FALSE),0)","v":80.8},{"$f":"_xlfn.IFNA(VLOOKUP(D8,'BAHAN PAKAN'!$D$7:$Y$106,18,FALSE),0)","v":0.05},{"$f":"_xlfn.IFNA(VLOOKUP(D8,'BAHAN PAKAN'!$D$7:$Y$106,19,FALSE),0)","v":0.3},{"$f":"_xlfn.IFNA(VLOOKUP(D8,'BAHAN PAKAN'!$D$7:$Y$106,20,FALSE),0)","v":0.39},{"$f":"_xlfn.IFNA(VLOOKUP(D8,'BAHAN PAKAN'!$D$7:$Y$106,21,FALSE),0)","v":0},{"$f":"_xlfn.IFNA(VLOOKUP(D8,'BAHAN PAKAN'!$D$7:$Y$106,22,FALSE),0)","v":86.3},{"$f":"AB8","v":"Jagung"},{"$f":"IF(H8>0,H8,0)","v":5},{"$f":"J8","v":5.0000000000000053},{"$f":"IF(N8>0,N8,100)","v":100},{"$f":"P8","v":"Kadar Air"},{"$f":"IF(T8>0,T8,0)","v":0},{"$f":"SUMPRODUCT(KadarAir,KomposisiRansum)/100","v":22.357642624508706},{"$f":"IF(X8>0,X8,100)","v":100},{"$f":"IFERROR(BC8,0)","v":5.7937427578215592},{"$f":"100/AS8*J8","v":5.7937427578215592}]
{"$rows_left_out":19}
{"sheet":"SAPI POTONG","index":5,"n_rows":26,"n_cols":55,"rows_kept":26,"cut":false,"hidden":false,"merged":[[4,15,4,23],[23,15,24,15],[24,21,24,23],[25,1,25,13]]}
[]
[null,null,null,"FORSUM for Ruminant ver 4.0++"]
[null,null,null," (c) 2019 Department of Nutrition and Feed Technology - IPB University",null,null,null,null,null,null,null,null,null,null,null,"Nama Ransum",":","Konsentrat Sapi Potong"]
[null,null,null,null,null,null,null,null,null,null,null,null,null,null,null,"Formulator",":","Idat G. Permana"]
[null,"Tabel 1. Komposisi Ransum (Least Cost Ration)",null,null,null,null,null,null,null,null,null,null,null,null,null,"Tabel 2. Kandungan Nutrien Ransum (% DM)",null,null,null,null,null,null,null,null,null,null,"Tabel 3. Perhitungan Ransum (Jangan Dihapus)"]
[" ","No",null,"Bahan Pakan",null,"Harga",null,"Min",null,"%BK",null,"%AsFeed",null,"Max",null,"Nutrien",null,"Unit",null,"Min",null,"Nutrien",null,"Max",null,null,"No","Ingredient","Harga BK","KA","Abu","PK","LK","SK","BETN","NDF","ADF","GE","DE","TDN","Ca","P","K","Na","BK","Bahan Pakan","Min","Komposisi Ransum","Max","Nutrien","Min","Nutrient","Max","%AsFeed","%AsFeed"]
[]
[null,1,null,"Jagung",null,{"$f":"_xlfn.IFNA(VLOOKUP($D8,'BAHAN PAKAN'!$D$7:$Y$106,4,FALSE),0)","v":4500},null,5,null,5.0000000000000178,null,{"$f":"BB8/($BB$24/100)","v":4.9952953168796768},null,null,null,"Kadar Air",null,"%",null,null,null,{"$f":"AZ8","v":13.393442769954639},null,null,null,null,1,{"$f":"_xlfn.IFNA(VLOOKUP(D8,'BAHAN PAKAN'!$D$7:$Y$106,1,FALSE),0)","v":"Jagung"},{"$f":"IF(F8>0,F8*100/AS8,99999999)","v":5214.3684820393973},{"$f":"_xlfn.IFNA(VLOOKUP(D8,'BAHAN PAKAN'!$D$7:$Y$106,6,FALSE),0)","v":13.700000000000003},{"$f":"_xlfn.IFNA(VLOOKUP(D8,'BAHAN PAKAN'!$D$7:$Y$106,8,FALSE),0)","v":1.4},{"$f":"_xlfn.IFNA(VLOOKUP(D8,'BAHAN PAKAN'!$D$7:$Y$106,9,FALSE),0)","v":9.4},{"$f":"_xlfn.IFNA(VLOOKUP(D8,'BAHAN PAKAN'!$D$7:$Y$106,10,FALSE),0)","v":4.3},{"$f":"_xlfn.IFNA(VLOOKUP(D8,'BAHAN PAKAN'!$D$7:$Y$106,11,FALSE),0)","v":2.5},{"$f":"_xlfn.IFNA(VLOOKUP(D8,'BAHAN PAKAN'!$D$7:$Y$106,12,FALSE),0)","v":82.4},{"$f":"_xlfn.IFNA(VLOOKUP(D8,'BAHAN PAKAN'!$D$7:$Y$106,13,FALSE),0)","v":12.2},{"$f":"_xlfn.IFNA(VLOOKUP(D8,'BAHAN PAKAN'!$D$7:$Y$106,14,FALSE),0)","v":3},{"$f":"_xlfn.IFNA(VLOOKUP(D8,'BAHAN PAKAN'!$D$7:$Y$106,15,FALSE),0)","v":18.7},{"$f":"_xlfn.IFNA(VLOOKUP(D8,'BAHAN PAKAN'!$D$7:$Y$106,16,FALSE),0)","v":12},{"$f":"_xlfn.IFNA(VLOOKUP(D8,'BAHAN PAKAN'!$D$7:$Y$106,17,FALSE),0)","v":80.8},{"$f":"_xlfn.IFNA(VLOOKUP(D8,'BAHAN PAKAN'!$D$7:$Y$106,18,FALSE),0)","v":0.05},{"$f":"_xlfn.IFNA(VLOOKUP(D8,'BAHAN PAKAN'!$D$7:$Y$106,19,FALSE),0)","v":0.3},{"$f":"_xlfn.IFNA(VLOOKUP(D8,'BAHAN PAKAN'!$D$7:$Y$106,20,FALSE),0)","v":0.39},{"$f":"_xlfn.IFNA(VLOOKUP(D8,'BAHAN PAKAN'!$D$7:$Y$106,21,FALSE),0)","v":0},{"$f":"_xlfn.IFNA(VLOOKUP(D8,'BAHAN PAKAN'!$D$7:$Y$106,22,FALSE),0)","v":86.3},{"$f":"AB8","v":"Jagung"},{"$f":"IF(H8>0,H8,0)","v":5},{"$f":"J8","v":5.0000000000000178},{"$f":"IF(N8>0,N8,100)","v":100},{"$f":"P8","v":"Kadar Air"},{"$f":"IF(T8>0,T8,0)","v":0},{"$f":"SUMPRODUCT(KadarAir,KomposisiRansum)/100","v":13.393442769954639},{"$f":"IF(X8>0,X8,100)","v":100},{"$f":"IFERROR(BC8,0)","v":5.7937427578215734},{"$f":"100/AS8*J8","v":5.7937427578215734}]
{"$rows_left_out":19}
{"sheet":"TRIAL & ERROR","index":6,"n_rows":26,"n_cols":55,"rows_kept":26,"cut":false,"hidden":false,"merged":[[4,15,4,23],[23,15,24,15],[25,1,25,13],[23,21,24,23]]}
[]
[null,null,null,"FORSUM for Ruminant ver 4.0++"]
[null,null,null," (c) 2019 Department of Nutrition and Feed Technology - IPB University",null,null,null,null,null,null,null,null,null,null,null,"Nama Ransum",":","Konsentrat Sapi Perah"]
[null,null,null,null,null,null,null,null,null,null,null,null,null,null,null,"Formulator",":","Idat G. Permana"]
[null,"Tabel 1. Komposisi Ransum (Trial & Errror)",null,null,null,null,null,null,null,null,null,null,null,null,null,"Tabel 2. Kandungan Nutrien Ransum (% DM)",null,null,null,null,null,null,null,null,null,null,"Tabel 3. Perhitungan Ransum (Jangan Dihapus)"]
[" ","No",null,"Bahan Pakan",null,"Harga",null,"Min",null,"%BK",null,"%AsFeed",null,"Max",null,"Nutrien",null,"Unit",null,"Min",null,"Nutrien",null,"Max",null,null,"No","Ingredient","Harga BK","KA","Abu","PK","LK","SK","BETN","NDF","ADF","GE","DE","TDN","Ca","P","K","Na","BK","Bahan Pakan","Min","Komposisi Ransum","Max","Nutrien","Min","Nutrient","Max","%AsFeed","%AsFeed"]
[]
[null,1,null,"Rumput gajah",null,{"$f":"_xlfn.IFNA(VLOOKUP($D8,'BAHAN PAKAN'!$D$7:$Y$106,4,FALSE),0)","v":230},null,null,null,60,null,{"$f":"BB8/($BB$24/100)","v":88.315926892950401},null,null,null,"Kadar Air",null,"%",null,null,null,{"$f":"AZ8","v":53.18},null,null,null,null,1,{"$f":"_xlfn.IFNA(VLOOKUP(D8,'BAHAN PAKAN'!$D$7:$Y$106,1,FALSE),0)","v":"Rumput gajah"},{"$f":"IF(F8>0,F8*100/AS8,99999999)","v":1284.916201117318},{"$f":"_xlfn.IFNA(VLOOKUP(D8,'BAHAN PAKAN'!$D$7:$Y$106,6,FALSE),0)","v":82.1},{"$f":"_xlfn.IFNA(VLOOKUP(D8,'BAHAN PAKAN'!$D$7:$Y$106,8,FALSE),0)","v":13.8},{"$f":"_xlfn.IFNA(VLOOKUP(D8,'BAHAN PAKAN'!$D$7:$Y$106,9,FALSE),0)","v":9.6999999999999993},{"$f":"_xlfn.IFNA(VLOOKUP(D8,'BAHAN PAKAN'!$D$7:$Y$106,10,FALSE),0)","v":2},{"$f":"_xlfn.IFNA(VLOOKUP(D8,'BAHAN PAKAN'!$D$7:$Y$106,11,FALSE),0)","v":36.1},{"$f":"_xlfn.IFNA(VLOOKUP(D8,'BAHAN PAKAN'!$D$7:$Y$106,12,FALSE),0)","v":38.4},{"$f":"_xlfn.IFNA(VLOOKUP(D8,'BAHAN PAKAN'!$D$7:$Y$106,13,FALSE),0)","v":71.5},{"$f":"_xlfn.IFNA(VLOOKUP(D8,'BAHAN PAKAN'!$D$7:$Y$106,14,FALSE),0)","v":42.5},{"$f":"_xlfn.IFNA(VLOOKUP(D8,'BAHAN PAKAN'!$D$7:$Y$106,15,FALSE),0)","v":17.399999999999999},{"$f":"_xlfn.IFNA(VLOOKUP(D8,'BAHAN PAKAN'!$D$7:$Y$106,16,FALSE),0)","v":10.199999999999999},{"$f":"_xlfn.IFNA(VLOOKUP(D8,'BAHAN PAKAN'!$D$7:$Y$106,17,FALSE),0)","v":58},{"$f":"_xlfn.IFNA(VLOOKUP(D8,'BAHAN PAKAN'!$D$7:$Y$106,18,FALSE),0)","v":0.36},{"$f":"_xlfn.IFNA(VLOOKUP(D8,'BAHAN PAKAN'!$D$7:$Y$106,19,FALSE),0)","v":0.28999999999999998},{"$f":"_xlfn.IFNA(VLOOKUP(D8,'BAHAN PAKAN'!$D$7:$Y$106,20,FALSE),0)","v":2.9},{"$f":"_xlfn.IFNA(VLOOKUP(D8,'BAHAN PAKAN'!$D$7:$Y$106,21,FALSE),0)","v":0.03},{"$f":"_xlfn.IFNA(VLOOKUP(D8,'BAHAN PAKAN'!$D$7:$Y$106,22,FALSE),0)","v":17.900000000000006},{"$f":"AB8","v":"Rumput gajah"},{"$f":"IF(H8>0,H8,0)","v":0},{"$f":"J8","v":60},{"$f":"IF(N8>0,N8,100)","v":100},{"$f":"P8","v":"Kadar Air"},{"$f":"IF(T8>0,T8,0)","v":0},{"$f":"SUMPRODUCT(KadarAir,KomposisiRansum)/100","v":53.18},{"$f":"IF(X8>0,X8,100)","v":100},{"$f":"IFERROR(BC8,0)","v":335.19553072625689},{"$f":"100/AS8*J8","v":335.19553072625689}]
{"$rows_left_out":19}
{"sheet":"CONTACT","index":7,"n_rows":15,"n_cols":2,"rows_kept":15,"cut":false,"hidden":false,"merged":[]}
[]
[null,"         FORSUM for Ruminant ver 4.0++"]
[null,"                     (c) 2019 Department of Nutrition and Feed Technology - IPB University"]
[]
[null,"About FORSUM"]
[null,"FORSUM for Ruminant is a simple ration formulation program using Excel Solver. The ration formulated from FORSUM is the least cost ration. Solver is an application based on Linear Programming (LP), which is a method to minimize costs."]
[]
[]
{"$rows_left_out":8}
{"sheet":"BACKUP","index":8,"n_rows":26,"n_cols":55,"rows_kept":26,"cut":false,"hidden":false,"merged":[[4,15,4,23],[23,15,24,15],[24,21,24,23],[25,1,25,13]]}
[]
[null,null,null,"FORSUM for Ruminant ver 4.0++"]
[null,null,null," (c) 2019 Department of Nutrition and Feed Technology - IPB University",null,null,null,null,null,null,null,null,null,null,null,"Nama Ransum",":","Konsentrat Sapi Perah"]
[null,null,null,null,null,null,null,null,null,null,null,null,null,null,null,"Formulator",":","Idat G. Permana"]
[null,"Tabel 1. Komposisi Ransum (Least Cost Ration)",null,null,null,null,null,null,null,null,null,null,null,null,null,"Tabel 2. Kandungan Nutrien Ransum (% DM)",null,null,null,null,null,null,null,null,null,null,"Tabel 3. Perhitungan Ransum (Jangan Dihapus)"]
[" ","No",null,"Bahan Pakan",null,"Harga",null,"Min",null,"%BK",null,"%AsFeed",null,"Max",null,"Nutrien",null,"Unit",null,"Min",null,"Nutrien",null,"Max",null,null,"No","Ingredient","Harga BK","KA","Abu","PK","LK","SK","BETN","NDF","ADF","GE","DE","TDN","Ca","P","K","Na","BK","Bahan Pakan","Min","Komposisi Ransum","Max","Nutrien","Min","Nutrient","Max","%AsFeed","%AsFeed"]
[]
[null,1,null,"Jagung",null,{"$f":"_xlfn.IFNA(VLOOKUP($D8,'BAHAN PAKAN'!$D$7:$Y$106,4,FALSE),0)","v":4500},null,5,null,5.0000000000000178,null,{"$f":"BB8/($BB$24/100)","v":4.9952953168796768},null,null,null,"Kadar Air",null,"%",null,null,null,{"$f":"AZ8","v":13.393442769954639},null,null,null,null,1,{"$f":"_xlfn.IFNA(VLOOKUP(D8,'BAHAN PAKAN'!$D$7:$Y$106,1,FALSE),0)","v":"Jagung"},{"$f":"IF(F8>0,F8*100/AS8,99999999)","v":5214.3684820393973},{"$f":"_xlfn.IFNA(VLOOKUP(D8,'BAHAN PAKAN'!$D$7:$Y$106,6,FALSE),0)","v":13.700000000000003},{"$f":"_xlfn.IFNA(VLOOKUP(D8,'BAHAN PAKAN'!$D$7:$Y$106,8,FALSE),0)","v":1.4},{"$f":"_xlfn.IFNA(VLOOKUP(D8,'BAHAN PAKAN'!$D$7:$Y$106,9,FALSE),0)","v":9.4},{"$f":"_xlfn.IFNA(VLOOKUP(D8,'BAHAN PAKAN'!$D$7:$Y$106,10,FALSE),0)","v":4.3},{"$f":"_xlfn.IFNA(VLOOKUP(D8,'BAHAN PAKAN'!$D$7:$Y$106,11,FALSE),0)","v":2.5},{"$f":"_xlfn.IFNA(VLOOKUP(D8,'BAHAN PAKAN'!$D$7:$Y$106,12,FALSE),0)","v":82.4},{"$f":"_xlfn.IFNA(VLOOKUP(D8,'BAHAN PAKAN'!$D$7:$Y$106,13,FALSE),0)","v":12.2},{"$f":"_xlfn.IFNA(VLOOKUP(D8,'BAHAN PAKAN'!$D$7:$Y$106,14,FALSE),0)","v":3},{"$f":"_xlfn.IFNA(VLOOKUP(D8,'BAHAN PAKAN'!$D$7:$Y$106,15,FALSE),0)","v":18.7},{"$f":"_xlfn.IFNA(VLOOKUP(D8,'BAHAN PAKAN'!$D$7:$Y$106,16,FALSE),0)","v":12},{"$f":"_xlfn.IFNA(VLOOKUP(D8,'BAHAN PAKAN'!$D$7:$Y$106,17,FALSE),0)","v":80.8},{"$f":"_xlfn.IFNA(VLOOKUP(D8,'BAHAN PAKAN'!$D$7:$Y$106,18,FALSE),0)","v":0.05},{"$f":"_xlfn.IFNA(VLOOKUP(D8,'BAHAN PAKAN'!$D$7:$Y$106,19,FALSE),0)","v":0.3},{"$f":"_xlfn.IFNA(VLOOKUP(D8,'BAHAN PAKAN'!$D$7:$Y$106,20,FALSE),0)","v":0.39},{"$f":"_xlfn.IFNA(VLOOKUP(D8,'BAHAN PAKAN'!$D$7:$Y$106,21,FALSE),0)","v":0},{"$f":"_xlfn.IFNA(VLOOKUP(D8,'BAHAN PAKAN'!$D$7:$Y$106,22,FALSE),0)","v":86.3},{"$f":"AB8","v":"Jagung"},{"$f":"IF(H8>0,H8,0)","v":5},{"$f":"J8","v":5.0000000000000178},{"$f":"IF(N8>0,N8,100)","v":100},{"$f":"P8","v":"Kadar Air"},{"$f":"IF(T8>0,T8,0)","v":0},{"$f":"SUMPRODUCT(KadarAir,KomposisiRansum)/100","v":13.393442769954639},{"$f":"IF(X8>0,X8,100)","v":100},{"$f":"IFERROR(BC8,0)","v":5.7937427578215734},{"$f":"100/AS8*J8","v":5.7937427578215734}]
{"$rows_left_out":18}